به بخش پرسش و پاسخ یادگیری عمیق خوش آمدید,
این نسخه آزمایشی سایت است.
لطفا به نکات زیر توجه کنید:
  • برای ارتباط با مدیران میتوانید از صفحه مدیران اقدام کنید.
  • سوال و جواب ها باید به زبان فارسی باشند. استفاده از زبان انگلیسی یا فینگلیش برای پاسخ دادن مجاز نیست.
  • لطفا بعد از پرسش سوال لینک سوال خود را در گرو تلگرام (Iran Deep Learning Group) معرفی کنید تا سریعتر به جواب برسید. برای دسترسی به آخرین لینک از منابع یادگیری استفاده کنید
  • لطفا بجای عکس از متن استفاده کنید. اگر متون طولانی هستند از سایت pastebin.com برای اپلود استفاده کرده و لینک حاصل را در سوال خود قرار دهید. برای قرار دادن تصویر ، از بخش ارسال تصویر ادیتور سایت استفاده کنید.
  • بعد از دریافت پاسخ، بهترین پاسخ را از طریق کلیک بر روی علامت تیک انتخاب کنید
  • اگر با خطا و یا مشکلی مواجه شدید از بخش تماس با ما در انتهای صفحه و یا ایمیل Coderx7@gmail.com موضوع را اطلاع دهید.

با تشکر

0 امتیاز

سلام. من برای نصب کفی دقیقا طبق آموزش پیش رفتم، کارت های گرافیکم Intel (R) HD Graphics 4000 و NVIDIA GeForce GT 740M هست، cuda8، cudnn6 و Anacunda3 و ویژوال 2015 و پایتون 3.6 رو دارم. ولی اول کار بعد از تکمیل کردن کانفیگ که میخواستم کامپایل کنم این اررورها رو داد:
The system cannot find the drive specified.
The system cannot find the drive specified.
INFO: ============================================================
INFO: Summary:
INFO: ============================================================
INFO: MSVC_VERSION = 14
INFO: WITH_NINJA = 0
INFO: CMAKE_GENERATOR = "Visual Studio 14 2015 Win64"
INFO: CPU_ONLY = 1
INFO: CUDA_ARCH_NAME = Auto
INFO: CMAKE_CONFIG = Release
INFO: USE_NCCL = 0
INFO: CMAKE_BUILD_SHARED_LIBS = 0
INFO: PYTHON_VERSION = 3.6
INFO: BUILD_PYTHON = 1
INFO: BUILD_PYTHON_LAYER = 1
INFO: BUILD_MATLAB = 1
INFO: PYTHON_EXE = "python"
INFO: RUN_TESTS = 0
INFO: RUN_LINT = 0
INFO: RUN_INSTALL = 1
INFO: ============================================================
'"C:\Program Files (x86)\Microsoft Visual Studio 14.0\Common7\Tools....VCvcvarsall.bat"' is not recognized as an internal or external command,
operable program or batch file.
-- Selecting Windows SDK version to target Windows 10.0.17134.
CMake Error at CMakeLists.txt:18 (project):
Failed to run MSBuild command:

C:/Program Files (x86)/MSBuild/14.0/bin/MSBuild.exe

to get the value of VCTargetsPath:

Microsoft (R) Build Engine version 14.0.25420.1
Copyright (C) Microsoft Corporation. All rights reserved.

Build started 27/05/1398 11:51:41 ب.ظ.
Project "C:\Users\Ali\Downloads\Compressed\Caffe_1.0_Windows-master\Caffe_1.0_Windows-master\build\CMakeFiles\3.15.2\VCTargetsPath.vcxproj" on node 1 (default targets).
C:\Program Files (x86)\MSBuild\Microsoft.Cpp\v4.0\V140\Platforms\x64\PlatformToolsets\v140\Toolset.targets(36,5): error MSB8036: The Windows SDK version 8.1 was not found. Install the required version of Windows SDK or change the SDK version in the project property pages or by right-clicking the solution and selecting "Retarget solution". [C:\Users\Ali\Downloads\Compressed\Caffe_1.0_Windows-master\Caffe_1.0_Windows-master\build\CMakeFiles\3.15.2\VCTargetsPath.vcxproj]
Done Building Project "C:\Users\Ali\Downloads\Compressed\Caffe_1.0_Windows-master\Caffe_1.0_Windows-master\build\CMakeFiles\3.15.2\VCTargetsPath.vcxproj" (default targets) -- FAILED.

Build FAILED.

"C:\Users\Ali\Downloads\Compressed\Caffe_1.0_Windows-master\Caffe_1.0_Windows-master\build\CMakeFiles\3.15.2\VCTargetsPath.vcxproj" (default target) (1) ->
(Desktop_PlatformPrepareForBuild target) ->
  C:\Program Files (x86)\MSBuild\Microsoft.Cpp\v4.0\V140\Platforms\x64\PlatformToolsets\v140\Toolset.targets(36,5): error MSB8036: The Windows SDK version 8.1 was not found. Install the required version of Windows SDK or change the SDK version in the project property pages or by right-clicking the solution and selecting "Retarget solution". [C:\Users\Ali\Downloads\Compressed\Caffe_1.0_Windows-master\Caffe_1.0_Windows-master\build\CMakeFiles\3.15.2\VCTargetsPath.vcxproj]

    0 Warning(s)
    1 Error(s)

Time Elapsed 00:00:05.11

Exit code: 1

-- Configuring incomplete, errors occurred!
See also "C:/Users/Ali/Downloads/Compressed/Caffe_1.0_Windows-master/Caffe_1.0_Windows-master/build/CMakeFiles/CMakeOutput.log".
ERROR: Configure failed

سوال شده توسط (100 امتیاز)

لطفا وارد شده یا عضو شوید تا بتوانید سوال بپرسید

...