به بخش پرسش و پاسخ یادگیری عمیق خوش آمدید,
این نسخه آزمایشی سایت است.
لطفا به نکات زیر توجه کنید:
  • برای ارتباط با مدیران میتوانید از صفحه مدیران اقدام کنید.
  • سوال و جواب ها باید به زبان فارسی باشند. استفاده از زبان انگلیسی یا فینگلیش برای پاسخ دادن مجاز نیست.
  • لطفا بعد از پرسش سوال لینک سوال خود را در گرو تلگرام (Iran Deep Learning Group) معرفی کنید تا سریعتر به جواب برسید. برای دسترسی به آخرین لینک از منابع یادگیری استفاده کنید
  • لطفا بجای عکس از متن استفاده کنید. اگر متون طولانی هستند از سایت pastebin.com برای اپلود استفاده کرده و لینک حاصل را در سوال خود قرار دهید. برای قرار دادن تصویر ، از بخش ارسال تصویر ادیتور سایت استفاده کنید.
  • بعد از دریافت پاسخ، بهترین پاسخ را از طریق کلیک بر روی علامت تیک انتخاب کنید
  • اگر با خطا و یا مشکلی مواجه شدید از بخش تماس با ما در انتهای صفحه و یا ایمیل Coderx7@gmail.com موضوع را اطلاع دهید.

با تشکر

0 امتیاز

با سلام
دوستان من کفی رو اولین بار کامل کامبال کردم همه چی اوکی بود ولی بخاطر مشکل کامبایل مت کفی مجبور شدم کفی رو باک کنم و دوباره کامبایلش کنم موقع کامبایل مت کفی هم این مشکل رو داشتم

-------------------------------------------------------------------------------
mm@mm:~/code/caffe$ make matcaffe
CXX src/caffe/syncedmem.cpp
In file included from ./include/caffe/common.hpp:19:0,
                 from src/caffe/syncedmem.cpp:1:
./include/caffe/util/device_alternate.hpp:34:23: fatal error: cublas_v2.h: No such file or directory
 #include <cublas_v2.h>
                       ^
compilation terminated.
make: *** [.build_release/src/caffe/syncedmem.o] Error 1

قبل اینا هم مشکل ورژن gcc رو داشتم که میگفت ورژن کنونی 4.8.4 هست ولی مورد نیاز 4.7 باید باشد حالا gcc رو باکش کردم ورژن 4.7 رو نصب کردم و بعد این مشکل بالایی رخ داد اگه درمورد بالایی میدونید لطفا بگید
حالا گفتم شاید بخاطر مشکل کامبایل باشه دوباره کفی رو دانلود کردم و خاستم دوباره کامبایل کنم این ارور رو میده

------------------------------------------------------------------------------------
mm@mm:~/code/caffe$   make all -j $(($(nproc) + 1))
PROTOC src/caffe/proto/caffe.proto
CXX src/caffe/syncedmem.cpp
CXX src/caffe/util/upgrade_proto.cpp
CXX src/caffe/util/db.cpp
CXX src/caffe/util/signal_handler.cpp
CXX src/caffe/util/math_functions.cpp
In file included from ./include/caffe/common.hpp:19:0,
                 from ./include/caffe/util/db.hpp:6,
                 from src/caffe/util/db.cpp:1:
./include/caffe/util/device_alternate.hpp:34:23: fatal error: cublas_v2.h: No such file or directory
 #include <cublas_v2.h>
                       ^
compilation terminated.
make: *** [.build_release/src/caffe/util/db.o] Error 1
make: *** Waiting for unfinished jobs....
In file included from ./include/caffe/common.hpp:19:0,
                 from src/caffe/util/upgrade_proto.cpp:8:
./include/caffe/util/device_alternate.hpp:34:23: fatal error: cublas_v2.h: No such file or directory
 #include <cublas_v2.h>
                       ^
compilation terminated.
make: *** [.build_release/src/caffe/util/upgrade_proto.o] Error 1
In file included from ./include/caffe/common.hpp:19:0,
                 from src/caffe/syncedmem.cpp:1:
./include/caffe/util/device_alternate.hpp:34:23: fatal error: cublas_v2.h: No such file or directory
 #include <cublas_v2.h>
                       ^
compilation terminated.
make: *** [.build_release/src/caffe/syncedmem.o] Error 1
In file included from ./include/caffe/common.hpp:19:0,
                 from ./include/caffe/blob.hpp:8,
                 from ./include/caffe/net.hpp:10,
                 from ./include/caffe/solver.hpp:7,
                 from ./include/caffe/util/signal_handler.h:5,
                 from src/caffe/util/signal_handler.cpp:7:
./include/caffe/util/device_alternate.hpp:34:23: fatal error: cublas_v2.h: No such file or directory
 #include <cublas_v2.h>
                       ^
compilation terminated.
make: *** [.build_release/src/caffe/util/signal_handler.o] Error 1
In file included from ./include/caffe/common.hpp:19:0,
                 from src/caffe/util/math_functions.cpp:6:
./include/caffe/util/device_alternate.hpp:34:23: fatal error: cublas_v2.h: No such file or directory
 #include <cublas_v2.h>
                       ^
compilation terminated.
make: *** [.build_release/src/caffe/util/math_functions.o] Error 1
سوال شده توسط (389 امتیاز)
ویرایش شده توسط

1 پاسخ

+1 امتیاز
 
بهترین پاسخ

سلام
قبل از انجام هر buildیی Make clean کنید .
برای رفع این مشکل CUDA رو نصب کنید یا اگر نصبه مسیرش رو در فایل make.config تصحیح یا وارد کنید. یا اگه قرار نیست از گرافیک استفاده کنید در make.config مود رو روی (CPU only (CPU_ONLY := 1 تنظیم کنید.

پاسخ داده شده توسط (4.3k امتیاز)
انتخاب شده توسط
ممنون
دوباره باید cuda , cudnn نصب شوند.
...